Reaction Details
TargetHistone deacetylase 1
LigandBDBM50195118
Substrate/Competitorn/a
Meas. Tech.ChEMBL_422136 (CHEMBL907072)
IC50 25±n/a nM
Citation Jones, PAltamura, SChakravarty, PKCecchetti, ODe Francesco, RGallinari, PIngenito, RMeinke, PTPetrocchi, ARowley, MScarpelli, RSerafini, SSteinkühler, C A series of novel, potent, and selective histone deacetylase inhibitors. Bioorg Med Chem Lett16:5948-52 (2006) 
 
Histone deacetylase 1
Name:Histone deacetylase 1
Type:Enzyme
Mol. Mass.:55090.27
Organism:Homo sapiens (Human)
Description:Q13547
Residue:482
BDBM50195118
NameBDBM50195118
Synonyms:(S)-2-(2-(5-methoxy-2-methyl-1H-indol-3-yl)acetamido)-8-oxo-N-(4-phenylthiazol-2-yl)nonanamide | CHEMBL217509
TypeSmall organic molecule
Emp. Form.C30H34N4O4S
Mol. Mass.546.68
SMILESCOc1ccc2[nH]c(C)c(CC(=O)N[C@@H](CCCCCC(C)=O)C(=O)Nc3nc(cs3)-c3ccccc3)c2c1