Reaction Details
TargetHistone deacetylase 1
LigandBDBM50195108
Substrate/Competitorn/a
Meas. Tech.ChEMBL_422136 (CHEMBL907072)
IC50 0.8±n/a nM
Citation Jones, PAltamura, SChakravarty, PKCecchetti, ODe Francesco, RGallinari, PIngenito, RMeinke, PTPetrocchi, ARowley, MScarpelli, RSerafini, SSteinkühler, C A series of novel, potent, and selective histone deacetylase inhibitors. Bioorg Med Chem Lett16:5948-52 (2006) 
 
Histone deacetylase 1
Name:Histone deacetylase 1
Type:Enzyme
Mol. Mass.:55090.27
Organism:Homo sapiens (Human)
Description:Q13547
Residue:482
BDBM50195108
NameBDBM50195108
Synonyms:(S)-N8-hydroxy-2-(2-(5-methoxy-2-methyl-1H-indol-3-yl)acetamido)-N1-(2-(2-phenyl-1H-indol-3-yl)ethyl)octanediamide | CHEMBL216641
TypeSmall organic molecule
Emp. Form.C36H41N5O5
Mol. Mass.623.7412
SMILESCOc1ccc2[nH]c(C)c(CC(=O)N[C@@H](CCCCCC(=O)NO)C(=O)NCCc3c([nH]c4ccccc34)-c3ccccc3)c2c1