Reaction Details
TargetHistone deacetylase 1
LigandBDBM19410
Substrate/Competitorn/a
Meas. Tech.ChEMBL_422136 (CHEMBL907072)
IC50 110±n/a nM
Citation Jones, PAltamura, SChakravarty, PKCecchetti, ODe Francesco, RGallinari, PIngenito, RMeinke, PTPetrocchi, ARowley, MScarpelli, RSerafini, SSteinkühler, C A series of novel, potent, and selective histone deacetylase inhibitors. Bioorg Med Chem Lett16:5948-52 (2006) 
 
Histone deacetylase 1
Name:Histone deacetylase 1
Type:Enzyme
Mol. Mass.:55090.27
Organism:Homo sapiens (Human)
Description:Q13547
Residue:482
BDBM19410
NameBDBM19410
Synonyms:CHEMBL27759 US11377423, MS-275 US9265734, MS-275 benzamide-type inhibitor, 3 | pyridin-3-ylmethyl N-({4-[(2-aminophenyl)carbamoyl]phenyl}methyl)carbamate
TypeSmall organic molecule
Emp. Form.C21H20N4O3
Mol. Mass.376.4085
SMILESNc1ccccc1NC(=O)c1ccc(CNC(=O)OCc2cccnc2)cc1