Reaction Details
TargetKappa-type opioid receptor
LigandBDBM60212
Substrate/Competitorn/a
Meas. Tech.ChEMBL_422417 (CHEMBL909852)
Ki 4.4±n/a nM
Citation Le Bourdonnec, BGoodman, AJGraczyk, TMBelanger, SSeida, PRDeHaven, RNDolle, RE Synthesis and pharmacological evaluation of novel octahydro-1H-pyrido[1,2-a]pyrazine as mu-opioid receptor antagonists. J Med Chem49:7290-306 (2006) 
 
Kappa-type opioid receptor
Name:Kappa-type opioid receptor
Type:G Protein-Coupled Receptor (GPCR)
Mol. Mass.:42648.76
Organism:Homo sapiens (Human)
Description:P41145
Residue:380
BDBM60212
NameBDBM60212
Synonyms:(4R,4aS,7aR,12bS)-3-(cyclopropylmethyl)-4a,9-bis(oxidanyl)-2,4,5,6,7a,13-hexahydro-1H-4,12-methanobenzofuro[3,2-e]isoquinoline-7-one;hydrochloride MLS000069607 SMR000058767 US9107954, naltrexone | cid_5485201
TypeSmall organic molecule
Emp. Form.C20H23NO4
Mol. Mass.341.4009
SMILESOc1ccc2C[C@H]3N(CC4CC4)CC[C@@]45[C@@H](Oc1c24)C(=O)CC[C@@]35O