Reaction Details
TargetKappa-type opioid receptor
LigandBDBM50199938
Substrate/Competitorn/a
Meas. Tech.ChEMBL_422417 (CHEMBL909852)
Ki 16±n/a nM
Citation Le Bourdonnec, BGoodman, AJGraczyk, TMBelanger, SSeida, PRDeHaven, RNDolle, RE Synthesis and pharmacological evaluation of novel octahydro-1H-pyrido[1,2-a]pyrazine as mu-opioid receptor antagonists. J Med Chem49:7290-306 (2006) 
 
Kappa-type opioid receptor
Name:Kappa-type opioid receptor
Type:G Protein-Coupled Receptor (GPCR)
Mol. Mass.:42648.76
Organism:Homo sapiens (Human)
Description:P41145
Residue:380
BDBM50199938
NameBDBM50199938
Synonyms:3-((3S,7R,8R,9alphaR)-3-cyclohexyl-7,8-dimethyl-octahydro-1Hpyrido[1,2-R]pyrazin-8-yl)phenol | CHEMBL375119
TypeSmall organic molecule
Emp. Form.C22H34N2O
Mol. Mass.342.5182
SMILESC[C@H]1CN2C[C@@H](NC[C@H]2C[C@@]1(C)c1cccc(O)c1)C1CCCCC1