Reaction Details
TargetMu-type opioid receptor
LigandBDBM50199936
Substrate/Competitorn/a
Meas. Tech.ChEMBL_422416 (CHEMBL909851)
Ki 1.3±n/a nM
Citation Le Bourdonnec, BGoodman, AJGraczyk, TMBelanger, SSeida, PRDeHaven, RNDolle, RE Synthesis and pharmacological evaluation of novel octahydro-1H-pyrido[1,2-a]pyrazine as mu-opioid receptor antagonists. J Med Chem49:7290-306 (2006) 
 
Mu-type opioid receptor
Name:Mu-type opioid receptor
Type:G Protein-Coupled Receptor (GPCR)
Mol. Mass.:44789.51
Organism:Homo sapiens (Human)
Description:P35372
Residue:400
BDBM50199936
NameBDBM50199936
Synonyms:3-((7R,8R,9alphaR)-7,8-dimethyl-2-(3-methylbenzyl)-octahydro-1H-pyrido[1,2-R]pyrazin-8-yl)phenol | CHEMBL217998
TypeSmall organic molecule
Emp. Form.C24H32N2O
Mol. Mass.364.5237
SMILESC[C@H]1CN2CCN(Cc3cccc(C)c3)C[C@H]2C[C@@]1(C)c1cccc(O)c1