Reaction Details
TargetMu-type opioid receptor
LigandBDBM50199948
Substrate/Competitorn/a
Meas. Tech.ChEMBL_422416 (CHEMBL909851)
Ki 7.4±n/a nM
Citation Le Bourdonnec, BGoodman, AJGraczyk, TMBelanger, SSeida, PRDeHaven, RNDolle, RE Synthesis and pharmacological evaluation of novel octahydro-1H-pyrido[1,2-a]pyrazine as mu-opioid receptor antagonists. J Med Chem49:7290-306 (2006) 
 
Mu-type opioid receptor
Name:Mu-type opioid receptor
Type:G Protein-Coupled Receptor (GPCR)
Mol. Mass.:44789.51
Organism:Homo sapiens (Human)
Description:P35372
Residue:400
BDBM50199948
NameBDBM50199948
Synonyms:3-((7R,8R,9alphaR)-2-(furan-2-ylmethyl)-7,8-dimethyl-octahydro-1H-pyrido[1,2-R]pyrazin-8-yl)phenol | CHEMBL374455
TypeSmall organic molecule
Emp. Form.C21H28N2O2
Mol. Mass.340.4592
SMILESC[C@H]1CN2CCN(Cc3ccco3)C[C@H]2C[C@@]1(C)c1cccc(O)c1