Reaction Details
TargetKappa-type opioid receptor
LigandBDBM50199931
Substrate/Competitorn/a
Meas. Tech.ChEMBL_422423 (CHEMBL909299)
Ki 11±n/a nM
Citation Le Bourdonnec, BGoodman, AJGraczyk, TMBelanger, SSeida, PRDeHaven, RNDolle, RE Synthesis and pharmacological evaluation of novel octahydro-1H-pyrido[1,2-a]pyrazine as mu-opioid receptor antagonists. J Med Chem49:7290-306 (2006) 
 
Kappa-type opioid receptor
Name:Kappa-type opioid receptor
Type:G Protein-Coupled Receptor (GPCR)
Mol. Mass.:42648.76
Organism:Homo sapiens (Human)
Description:P41145
Residue:380
BDBM50199931
NameBDBM50199931
Synonyms:3-((3S,7R,8R,9alphaR)-7,8-dimethyl-3-phenyl-octahydro-1H-pyrido[1,2-R]pyrazin-8-yl)benzamide | CHEMBL373707
TypeSmall organic molecule
Emp. Form.C23H29N3O
Mol. Mass.363.4959
SMILESC[C@H]1CN2C[C@@H](NC[C@H]2C[C@@]1(C)c1cccc(c1)C(N)=O)c1ccccc1