Reaction Details
TargetMu-type opioid receptor
LigandBDBM50199953
Substrate/Competitorn/a
Meas. Tech.ChEMBL_422416 (CHEMBL909851)
Ki 17±n/a nM
Citation Le Bourdonnec, BGoodman, AJGraczyk, TMBelanger, SSeida, PRDeHaven, RNDolle, RE Synthesis and pharmacological evaluation of novel octahydro-1H-pyrido[1,2-a]pyrazine as mu-opioid receptor antagonists. J Med Chem49:7290-306 (2006) 
 
Mu-type opioid receptor
Name:Mu-type opioid receptor
Type:G Protein-Coupled Receptor (GPCR)
Mol. Mass.:44789.51
Organism:Homo sapiens (Human)
Description:P35372
Residue:400
BDBM50199953
NameBDBM50199953
Synonyms:1-((7R,8R,9alphaR)-8-(3-hydroxyphenyl)-7,8-dimethyl-hexahydro-1H-pyrido[1,2-R]pyrazin-2(6H)-yl)-2-phenylethanone | CHEMBL218135
TypeSmall organic molecule
Emp. Form.C24H30N2O2
Mol. Mass.378.5072
SMILESC[C@H]1CN2CCN(C[C@H]2C[C@@]1(C)c1cccc(O)c1)C(=O)Cc1ccccc1