Reaction Details
TargetDelta-type opioid receptor
LigandBDBM50199902
Substrate/Competitorn/a
Meas. Tech.ChEMBL_422439 (CHEMBL908255)
Ki 900±n/a nM
Citation Le Bourdonnec, BGoodman, AJMichaut, MYe, HFGraczyk, TMBelanger, SHerbertz, TYap, GPDeHaven, RNDolle, RE Elucidation of the bioactive conformation of the N-substituted trans-3,4-dimethyl-4-(3-hydroxyphenyl)piperidine class of mu-opioid receptor antagonists. J Med Chem49:7278-89 (2006) 
 
Delta-type opioid receptor
Name:Delta-type opioid receptor
Type:G Protein-Coupled Receptor (GPCR)
Mol. Mass.:40382.98
Organism:Homo sapiens (Human)
Description:Competition binding assays were carried out using membrane preparations from transfected HN9.10 cells that constitutively expressed the delta opioid receptor.
Residue:372
BDBM50199902
NameBDBM50199902
Synonyms:3-((2R,3R,7S,9RR)-2,3-dimethyl-7-phenyl-octahydro-1H-quinolizin-2-yl)phenol | CHEMBL387248
TypeSmall organic molecule
Emp. Form.C23H29NO
Mol. Mass.335.4825
SMILESC[C@H]1CN2C[C@@H](CC[C@@H]2C[C@@]1(C)c1cccc(O)c1)c1ccccc1