Reaction Details
TargetKappa-type opioid receptor
LigandBDBM50199900
Substrate/Competitorn/a
Meas. Tech.ChEMBL_422446 (CHEMBL909320)
EC50 200±n/a nM
Citation Le Bourdonnec, BGoodman, AJMichaut, MYe, HFGraczyk, TMBelanger, SHerbertz, TYap, GPDeHaven, RNDolle, RE Elucidation of the bioactive conformation of the N-substituted trans-3,4-dimethyl-4-(3-hydroxyphenyl)piperidine class of mu-opioid receptor antagonists. J Med Chem49:7278-89 (2006) 
 
Kappa-type opioid receptor
Name:Kappa-type opioid receptor
Type:G Protein-Coupled Receptor (GPCR)
Mol. Mass.:42648.76
Organism:Homo sapiens (Human)
Description:P41145
Residue:380
BDBM50199900
NameBDBM50199900
Synonyms:3-((1R,2R,7S,9-alpha-S)-1,2-dimethyl-7-phenyl-octahydro-1H-quinolizin-2-yl)phenol | CHEMBL438821
TypeSmall organic molecule
Emp. Form.C23H29NO
Mol. Mass.335.4825
SMILESC[C@H]1[C@@H]2CC[C@H](CN2CC[C@@]1(C)c1cccc(O)c1)c1ccccc1