Reaction Details
TargetKappa-type opioid receptor
LigandBDBM50045767
Substrate/Competitorn/a
Meas. Tech.ChEMBL_422446 (CHEMBL909320)
Ki 17±n/a nM
Citation Le Bourdonnec, BGoodman, AJMichaut, MYe, HFGraczyk, TMBelanger, SHerbertz, TYap, GPDeHaven, RNDolle, RE Elucidation of the bioactive conformation of the N-substituted trans-3,4-dimethyl-4-(3-hydroxyphenyl)piperidine class of mu-opioid receptor antagonists. J Med Chem49:7278-89 (2006) 
 
Kappa-type opioid receptor
Name:Kappa-type opioid receptor
Type:G Protein-Coupled Receptor (GPCR)
Mol. Mass.:42648.76
Organism:Homo sapiens (Human)
Description:P41145
Residue:380
BDBM50045767
NameBDBM50045767
Synonyms:(+)-N-phenethyl trans-3(R),4(R)-dimethyl-4-(3-hydroxyphenyl)piperidine 3-(3,4-Dimethyl-1-phenethyl-piperidin-4-yl)-phenol CHEMBL319536 | N-phenethyltrans-3,4-dimethyl-4-(3-hydroxyphenyl)piperidine
TypeSmall organic molecule
Emp. Form.C21H27NO
Mol. Mass.309.4452
SMILESC[C@H]1CN(CCc2ccccc2)CC[C@@]1(C)c1cccc(O)c1