Reaction Details
TargetCannabinoid receptor 1
LigandBDBM50200165
Substrate/Competitorn/a
Meas. Tech.ChEMBL_422555 (CHEMBL911052)
Ki 1200±n/a nM
Citation Murineddu, GLazzari, PRuiu, SSanna, ALoriga, GManca, IFalzoi, MDessì, CCurzu, MMChelucci, GPani, LPinna, GA Tricyclic pyrazoles. 4. Synthesis and biological evaluation of analogues of the robust and selective CB2 cannabinoid ligand 1-(2',4'-dichlorophenyl)-6-methyl-N-piperidin-1-yl-1,4-dihydroindeno[1,2-c]pyrazole-3-carboxamide. J Med Chem49:7502-12 (2006) 
 
Cannabinoid receptor 1
Name:Cannabinoid receptor 1
Type:Enzyme
Mol. Mass.:52842.52
Organism:Mus musculus (Mouse)
Description:P47746
Residue:473
BDBM50200165
NameBDBM50200165
Synonyms:6-chloro-1-(2',4'-dichlorophenyl)-7-methyl-N-piperidin-1-yl-1,4-dihydroindeno[1,2-c]pyrazole-3-carboxamide | CHEMBL216595
TypeSmall organic molecule
Emp. Form.C23H21Cl3N4O
Mol. Mass.475.798
SMILESCc1cc-2c(Cc3c(nn(c-23)-c2ccc(Cl)cc2Cl)C(=O)NN2CCCCC2)cc1Cl