Reaction Details
TargetCannabinoid receptor 1
LigandBDBM50200177
Substrate/Competitorn/a
Meas. Tech.ChEMBL_422555 (CHEMBL911052)
Ki 833±n/a nM
Citation Murineddu, GLazzari, PRuiu, SSanna, ALoriga, GManca, IFalzoi, MDessì, CCurzu, MMChelucci, GPani, LPinna, GA Tricyclic pyrazoles. 4. Synthesis and biological evaluation of analogues of the robust and selective CB2 cannabinoid ligand 1-(2',4'-dichlorophenyl)-6-methyl-N-piperidin-1-yl-1,4-dihydroindeno[1,2-c]pyrazole-3-carboxamide. J Med Chem49:7502-12 (2006) 
 
Cannabinoid receptor 1
Name:Cannabinoid receptor 1
Type:Enzyme
Mol. Mass.:52842.52
Organism:Mus musculus (Mouse)
Description:P47746
Residue:473
BDBM50200177
NameBDBM50200177
Synonyms:7-chloro-1-(2',4'-dichlorophenyl)-6-methyl-N-cyclohexylamine-1,4-dihydroindeno[1,2-c]pyrazole-3-carboxamide | CHEMBL386014
TypeSmall organic molecule
Emp. Form.C24H22Cl3N3O
Mol. Mass.474.81
SMILESCc1cc2Cc3c(nn(c3-c2cc1Cl)-c1ccc(Cl)cc1Cl)C(=O)NC1CCCCC1