Reaction Details
TargetCannabinoid receptor 1
LigandBDBM50200841
Substrate/Competitorn/a
Meas. Tech.ChEMBL_422611 (CHEMBL911647)
EC50 2.4±n/a nM
Citation Lin, LSLanza, TJJewell, JPLiu, PShah, SKQi, HTong, XWang, JXu, SSFong, TMShen, CPLao, JXiao, JCShearman, LPStribling, DSRosko, KStrack, AMarsh, DJFeng, YKumar, SSamuel, KYin, WVan der Ploeg, LHGoulet, MTHagmann, WK Discovery of N-[(1S,2S)-3-(4-Chlorophenyl)-2- (3-cyanophenyl)-1-methylpropyl]-2-methyl-2- {[5-(trifluoromethyl)pyridin-2-yl]oxy}propanamide (MK-0364), a novel, acyclic cannabinoid-1 receptor inverse agonist for the treatment of obesity. J Med Chem49:7584-7 (2006) 
 
Cannabinoid receptor 1
Name:Cannabinoid receptor 1
Type:G Protein-Coupled Receptor (GPCR)
Mol. Mass.:52868.96
Organism:Homo sapiens (Human)
Description:P21554
Residue:472
BDBM50200841
NameBDBM50200841
Synonyms:CHEMBL220360 MK-0634 N-[(1S,2S)-3-(4-chlorophenyl)-2-(3-cyanophenyl)-1-methylpropyl]-2-methyl-2-{[5-(trifluoromethyl)pyridin-2-yl]oxy}propanamide Taranbant
TypeSmall organic molecule
Emp. Form.C27H25ClF3N3O2
Mol. Mass.515.955
SMILESC[C@H](NC(=O)C(C)(C)Oc1ccc(cn1)C(F)(F)F)[C@@H](Cc1ccc(Cl)cc1)c1cccc(c1)C#N