Reaction Details
TargetCannabinoid receptor 2
LigandBDBM50200844
Substrate/Competitorn/a
Meas. Tech.ChEMBL_422599 (CHEMBL911627)
IC50 200±n/a nM
Citation Lin, LSLanza, TJJewell, JPLiu, PShah, SKQi, HTong, XWang, JXu, SSFong, TMShen, CPLao, JXiao, JCShearman, LPStribling, DSRosko, KStrack, AMarsh, DJFeng, YKumar, SSamuel, KYin, WVan der Ploeg, LHGoulet, MTHagmann, WK Discovery of N-[(1S,2S)-3-(4-Chlorophenyl)-2- (3-cyanophenyl)-1-methylpropyl]-2-methyl-2- {[5-(trifluoromethyl)pyridin-2-yl]oxy}propanamide (MK-0364), a novel, acyclic cannabinoid-1 receptor inverse agonist for the treatment of obesity. J Med Chem49:7584-7 (2006) 
 
Cannabinoid receptor 2
Name:Cannabinoid receptor 2
Type:G Protein-Coupled Receptor (GPCR)
Mol. Mass.:39690.94
Organism:Homo sapiens (Human)
Description:P34972
Residue:360
BDBM50200844
NameBDBM50200844
Synonyms:CHEMBL219480 N-[(1S,2S)-3-(4-chlorophenyl)-1-methyl-2-phenylpropyl]-2-(3,5-difluorophenyloxy)-2-methylpropanamide
TypeSmall organic molecule
Emp. Form.C26H26ClF2NO2
Mol. Mass.457.94
SMILESC[C@H](NC(=O)C(C)(C)Oc1cc(F)cc(F)c1)[C@@H](Cc1ccc(Cl)cc1)c1ccccc1