Reaction Details
TargetCannabinoid receptor 2
LigandBDBM50200837
Substrate/Competitorn/a
Meas. Tech.ChEMBL_422599 (CHEMBL911627)
IC50>2000±n/a nM
Citation Lin, LSLanza, TJJewell, JPLiu, PShah, SKQi, HTong, XWang, JXu, SSFong, TMShen, CPLao, JXiao, JCShearman, LPStribling, DSRosko, KStrack, AMarsh, DJFeng, YKumar, SSamuel, KYin, WVan der Ploeg, LHGoulet, MTHagmann, WK Discovery of N-[(1S,2S)-3-(4-Chlorophenyl)-2- (3-cyanophenyl)-1-methylpropyl]-2-methyl-2- {[5-(trifluoromethyl)pyridin-2-yl]oxy}propanamide (MK-0364), a novel, acyclic cannabinoid-1 receptor inverse agonist for the treatment of obesity. J Med Chem49:7584-7 (2006) 
 
Cannabinoid receptor 2
Name:Cannabinoid receptor 2
Type:G Protein-Coupled Receptor (GPCR)
Mol. Mass.:39690.94
Organism:Homo sapiens (Human)
Description:P34972
Residue:360
BDBM50200837
NameBDBM50200837
Synonyms:(1R,2R)-N-[2,3-bis(4-chlorophenyl)-1-methylpropyl]-2-(4-chlorophenyloxy)-2-methylpropanamide CHEMBL427236
TypeSmall organic molecule
Emp. Form.C26H26Cl3NO2
Mol. Mass.490.849
SMILESC[C@H](NC(=O)C(C)(C)Oc1ccc(Cl)cc1)[C@@H](Cc1ccc(Cl)cc1)c1ccc(Cl)cc1