Reaction Details
TargetCannabinoid receptor 2
LigandBDBM50200835
Substrate/Competitorn/a
Meas. Tech.ChEMBL_422599 (CHEMBL911627)
IC50 610±n/a nM
Citation Lin, LSLanza, TJJewell, JPLiu, PShah, SKQi, HTong, XWang, JXu, SSFong, TMShen, CPLao, JXiao, JCShearman, LPStribling, DSRosko, KStrack, AMarsh, DJFeng, YKumar, SSamuel, KYin, WVan der Ploeg, LHGoulet, MTHagmann, WK Discovery of N-[(1S,2S)-3-(4-Chlorophenyl)-2- (3-cyanophenyl)-1-methylpropyl]-2-methyl-2- {[5-(trifluoromethyl)pyridin-2-yl]oxy}propanamide (MK-0364), a novel, acyclic cannabinoid-1 receptor inverse agonist for the treatment of obesity. J Med Chem49:7584-7 (2006) 
 
Cannabinoid receptor 2
Name:Cannabinoid receptor 2
Type:G Protein-Coupled Receptor (GPCR)
Mol. Mass.:39690.94
Organism:Homo sapiens (Human)
Description:P34972
Residue:360
BDBM50200835
NameBDBM50200835
Synonyms:CHEMBL219188 | N-[3-(4-chlorophenyl)-1-methyl-2-phenylpropyl]-2-(4-chlorophenyloxy)-2-methylpropanamide
TypeSmall organic molecule
Emp. Form.C26H27Cl2NO2
Mol. Mass.456.404
SMILESCC(NC(=O)C(C)(C)Oc1ccc(Cl)cc1)C(Cc1ccc(Cl)cc1)c1ccccc1