Reaction Details
TargetC-X-C chemokine receptor type 2
LigandBDBM50200877
Substrate/Competitorn/a
Meas. Tech.ChEMBL_422684 (CHEMBL909848)
IC50 5.3±n/a nM
Citation Dwyer, MPYu, YChao, JAki, CChao, JBiju, PGirijavallabhan, VRindgen, DBond, RMayer-Ezel, RJakway, JHipkin, RWFossetta, JGonsiorek, WBian, HFan, XTerminelli, CFine, JLundell, DMerritt, JRRokosz, LLKaiser, BLi, GWang, WStauffer, TOzgur, LBaldwin, JTaveras, AG Discovery of 2-hydroxy-N,N-dimethyl-3-{2-[[(R)-1-(5- methylfuran-2-yl)propyl]amino]-3,4-dioxocyclobut-1-enylamino}benzamide (SCH 527123): a potent, orally bioavailable CXCR2/CXCR1 receptor antagonist. J Med Chem49:7603-6 (2006) 
 
C-X-C chemokine receptor type 2
Name:C-X-C chemokine receptor type 2
Type:Protein
Mol. Mass.:40767.88
Organism:Homo sapiens (Human)
Description:P25025
Residue:360
BDBM50200877
NameBDBM50200877
Synonyms:(R)-2-hydroxy-N,N-dimethyl-3-(2-(1-(5-methylthiophen-2-yl)propylamino)-3,4-dioxocyclobut-1-enylamino)benzamide | CHEMBL415446
TypeSmall organic molecule
Emp. Form.C21H23N3O4S
Mol. Mass.413.49
SMILESCC[C@@H](Nc1c(Nc2cccc(C(=O)N(C)C)c2O)c(=O)c1=O)c1ccc(C)s1