Reaction Details
TargetC-X-C chemokine receptor type 1
LigandBDBM50200886
Substrate/Competitorn/a
Meas. Tech.ChEMBL_422685 (CHEMBL912816)
IC50 775±n/a nM
Citation Dwyer, MPYu, YChao, JAki, CChao, JBiju, PGirijavallabhan, VRindgen, DBond, RMayer-Ezel, RJakway, JHipkin, RWFossetta, JGonsiorek, WBian, HFan, XTerminelli, CFine, JLundell, DMerritt, JRRokosz, LLKaiser, BLi, GWang, WStauffer, TOzgur, LBaldwin, JTaveras, AG Discovery of 2-hydroxy-N,N-dimethyl-3-{2-[[(R)-1-(5- methylfuran-2-yl)propyl]amino]-3,4-dioxocyclobut-1-enylamino}benzamide (SCH 527123): a potent, orally bioavailable CXCR2/CXCR1 receptor antagonist. J Med Chem49:7603-6 (2006) 
 
C-X-C chemokine receptor type 1
Name:C-X-C chemokine receptor type 1
Type:Enzyme
Mol. Mass.:39803.83
Organism:Homo sapiens (Human)
Description:P25024
Residue:350
BDBM50200886
NameBDBM50200886
Synonyms:(R)-2-hydroxy-N,N-dimethyl-3-(2-(1-(5-methylfuran-2-yl)ethylamino)-3,4-dioxocyclobut-1-enylamino)benzamide | CHEMBL216602
TypeSmall organic molecule
Emp. Form.C20H21N3O5
Mol. Mass.383.3978
SMILESC[C@@H](Nc1c(Nc2cccc(C(=O)N(C)C)c2O)c(=O)c1=O)c1ccc(C)o1