Reaction Details
TargetGlucocorticoid receptor
LigandBDBM50201094
Substrate/Competitorn/a
Meas. Tech.ChEMBL_423016 (CHEMBL909349)
IC50 10±n/a nM
Citation Regan, JLee, TWZindell, RMBekkali, YBentzien, JGilmore, THammach, AKirrane, TMKukulka, AJKuzmich, DNelson, RMProudfoot, JRRalph, MPelletier, JSouza, DZuvela-Jelaska, LNabozny, GThomson, DS Quinol-4-ones as steroid A-ring mimetics in nonsteroidal dissociated glucocorticoid agonists. J Med Chem49:7887-96 (2006) 
 
Glucocorticoid receptor
Name:Glucocorticoid receptor
Type:Enzyme
Mol. Mass.:85656.87
Organism:Homo sapiens (Human)
Description:P04150
Residue:777
BDBM50201094
NameBDBM50201094
Synonyms:1-[4-(5-fluoro-2-methylphenyl)-2-hydroxy-4-methyl-2-(trifluoromethyl)pentyl]-1H-quinolin-4-one | CHEMBL216173
TypeSmall organic molecule
Emp. Form.C23H23F4NO2
Mol. Mass.421.4278
SMILESCc1ccc(F)cc1C(C)(C)CC(O)(Cn1ccc(=O)c2ccccc12)C(F)(F)F