Reaction Details
TargetGlucocorticoid receptor
LigandBDBM50201104
Substrate/Competitorn/a
Meas. Tech.ChEMBL_423016 (CHEMBL909349)
IC50 8±n/a nM
Citation Regan, JLee, TWZindell, RMBekkali, YBentzien, JGilmore, THammach, AKirrane, TMKukulka, AJKuzmich, DNelson, RMProudfoot, JRRalph, MPelletier, JSouza, DZuvela-Jelaska, LNabozny, GThomson, DS Quinol-4-ones as steroid A-ring mimetics in nonsteroidal dissociated glucocorticoid agonists. J Med Chem49:7887-96 (2006) 
 
Glucocorticoid receptor
Name:Glucocorticoid receptor
Type:Enzyme
Mol. Mass.:85656.87
Organism:Homo sapiens (Human)
Description:P04150
Residue:777
BDBM50201104
NameBDBM50201104
Synonyms:4-(5-fluoro-2-methoxyphenyl)-2-hydroxy-4-methyl-N-(4-methyl-1-oxo-1H-benzo[d][1,2]oxazin-6-yl)-2-(trifluoromethyl)pentanamide | CHEMBL263091
TypeSmall organic molecule
Emp. Form.C23H22F4N2O5
Mol. Mass.482.4248
SMILESCOc1ccc(F)cc1C(C)(C)CC(O)(C(=O)Nc1ccc2c(c1)c(C)noc2=O)C(F)(F)F