Reaction Details
TargetGlucocorticoid receptor
LigandBDBM50201093
Substrate/Competitorn/a
Meas. Tech.ChEMBL_423016 (CHEMBL909349)
IC50 3±n/a nM
Citation Regan, JLee, TWZindell, RMBekkali, YBentzien, JGilmore, THammach, AKirrane, TMKukulka, AJKuzmich, DNelson, RMProudfoot, JRRalph, MPelletier, JSouza, DZuvela-Jelaska, LNabozny, GThomson, DS Quinol-4-ones as steroid A-ring mimetics in nonsteroidal dissociated glucocorticoid agonists. J Med Chem49:7887-96 (2006) 
 
Glucocorticoid receptor
Name:Glucocorticoid receptor
Type:Enzyme
Mol. Mass.:85656.87
Organism:Homo sapiens (Human)
Description:P04150
Residue:777
BDBM50201093
NameBDBM50201093
Synonyms:1-[4-(4-fluoro-2-hydroxyphenyl)-2-hydroxy-4-methyl-2-(trifluoromethyl)pentyl]-1H-quinolin-4-one | CHEMBL219207
TypeSmall organic molecule
Emp. Form.C22H21F4NO3
Mol. Mass.423.4007
SMILESCC(C)(CC(O)(Cn1ccc(=O)c2ccccc12)C(F)(F)F)c1ccc(F)cc1O