Reaction Details
TargetGlucocorticoid receptor
LigandBDBM50201091
Substrate/Competitorn/a
Meas. Tech.ChEMBL_423016 (CHEMBL909349)
IC50 38±n/a nM
Citation Regan, JLee, TWZindell, RMBekkali, YBentzien, JGilmore, THammach, AKirrane, TMKukulka, AJKuzmich, DNelson, RMProudfoot, JRRalph, MPelletier, JSouza, DZuvela-Jelaska, LNabozny, GThomson, DS Quinol-4-ones as steroid A-ring mimetics in nonsteroidal dissociated glucocorticoid agonists. J Med Chem49:7887-96 (2006) 
 
Glucocorticoid receptor
Name:Glucocorticoid receptor
Type:Enzyme
Mol. Mass.:85656.87
Organism:Homo sapiens (Human)
Description:P04150
Residue:777
BDBM50201091
NameBDBM50201091
Synonyms:2-[(cis-2,6-dimethylmorpholin-4-yl)methyl]-1,1,1-trifluoro-4-(5-fluoro-2-methoxyphenyl)-4-methylpentan-2-ol | CHEMBL375348
TypeSmall organic molecule
Emp. Form.C20H29F4NO3
Mol. Mass.407.4428
SMILESCOc1ccc(F)cc1C(C)(C)CC(O)(CN1C[C@H](C)O[C@H](C)C1)C(F)(F)F