Reaction Details
TargetPeptide deformylase 1A, chloroplastic/mitochondrial
LigandBDBM50201872
Substrate/Competitorn/a
Meas. Tech.ChEMBL_423228 (CHEMBL912247)
IC50 450000±n/a nM
Citation Boularot, AGiglione, CPetit, SDuroc, YAlves de Sousa, RLarue, VCresteil, TDardel, FArtaud, IMeinnel, T Discovery and refinement of a new structural class of potent peptide deformylase inhibitors. J Med Chem50:10-20 (2007) 
 
Peptide deformylase 1A, chloroplastic/mitochondrial
Name:Peptide deformylase 1A, chloroplastic/mitochondrial
Type:PROTEIN
Mol. Mass.:30001.50
Organism:Arabidopsis thaliana
Description:ChEMBL_423228
Residue:269
BDBM50201872
NameBDBM50201872
Synonyms:2-(5-bromo-2-methyl-1H-indolyl)-N-hydroxyacetamide | CHEMBL219460
TypeSmall organic molecule
Emp. Form.C12H13BrN2O2
Mol. Mass.297.148
SMILESCc1[nH]c2ccc(Br)cc2c1CC(=O)CNO