Reaction Details
TargetPeptide deformylase 1A, chloroplastic/mitochondrial
LigandBDBM50201891
Substrate/Competitorn/a
Meas. Tech.ChEMBL_423228 (CHEMBL912247)
IC50 500000±n/a nM
Citation Boularot, AGiglione, CPetit, SDuroc, YAlves de Sousa, RLarue, VCresteil, TDardel, FArtaud, IMeinnel, T Discovery and refinement of a new structural class of potent peptide deformylase inhibitors. J Med Chem50:10-20 (2007) 
 
Peptide deformylase 1A, chloroplastic/mitochondrial
Name:Peptide deformylase 1A, chloroplastic/mitochondrial
Type:PROTEIN
Mol. Mass.:30001.50
Organism:Arabidopsis thaliana
Description:ChEMBL_423228
Residue:269
BDBM50201891
NameBDBM50201891
Synonyms:CHEMBL376018 | N-((5-bromo-2-methyl-1(phenylsulfonyl)-1H-indol-3-yl)methyl)hydroxylamine
TypeSmall organic molecule
Emp. Form.C16H15BrN2O3S
Mol. Mass.395.271
SMILESCc1c(CNO)c2cc(Br)ccc2n1S(=O)(=O)c1ccccc1