Reaction Details
TargetP-selectin glycoprotein ligand 1
LigandBDBM50201893
Substrate/Competitorn/a
Meas. Tech.ChEMBL_423294 (CHEMBL855465)
IC50 700000±n/a nM
Citation Kaila, NJanz, KDeBernardo, SBedard, PWCamphausen, RTTam, STsao, DHKeith, JCNickerson-Nutter, CShilling, AYoung-Sciame, RWang, Q Synthesis and biological evaluation of quinoline salicylic acids as P-selectin antagonists. J Med Chem50:21-39 (2007) 
 
P-selectin glycoprotein ligand 1
Name:P-selectin glycoprotein ligand 1
Type:PROTEIN
Mol. Mass.:43174.76
Organism:Homo sapiens (Human)
Description:ChEMBL_649756
Residue:412
BDBM50201893
NameBDBM50201893
Synonyms:2-(4-chlorophenyl)-3-hydroxy-8-methylquinoline-4-carboxylicacid | CHEMBL375815
TypeSmall organic molecule
Emp. Form.C17H12ClNO3
Mol. Mass.313.735
SMILESCc1cccc2c(C(O)=O)c(O)c(nc12)-c1ccc(Cl)cc1