Reaction Details
TargetP-selectin glycoprotein ligand 1
LigandBDBM50201903
Substrate/Competitorn/a
Meas. Tech.ChEMBL_423294 (CHEMBL855465)
IC50 2000000±n/a nM
Citation Kaila, NJanz, KDeBernardo, SBedard, PWCamphausen, RTTam, STsao, DHKeith, JCNickerson-Nutter, CShilling, AYoung-Sciame, RWang, Q Synthesis and biological evaluation of quinoline salicylic acids as P-selectin antagonists. J Med Chem50:21-39 (2007) 
 
P-selectin glycoprotein ligand 1
Name:P-selectin glycoprotein ligand 1
Type:PROTEIN
Mol. Mass.:43174.76
Organism:Homo sapiens (Human)
Description:ChEMBL_649756
Residue:412
BDBM50201903
NameBDBM50201903
Synonyms:2-(4-chlorophenyl)-3-hydroxy-8-(4-hydroxymethylphenyl)-quinoline-4-carboxylic acid | CHEMBL219232
TypeSmall organic molecule
Emp. Form.C23H16ClNO4
Mol. Mass.405.83
SMILESOCc1ccc(cc1)-c1cccc2c(C(O)=O)c(O)c(nc12)-c1ccc(Cl)cc1