Reaction Details
TargetP-selectin glycoprotein ligand 1
LigandBDBM50201904
Substrate/Competitorn/a
Meas. Tech.ChEMBL_423294 (CHEMBL855465)
IC50 1000000±n/a nM
Citation Kaila, NJanz, KDeBernardo, SBedard, PWCamphausen, RTTam, STsao, DHKeith, JCNickerson-Nutter, CShilling, AYoung-Sciame, RWang, Q Synthesis and biological evaluation of quinoline salicylic acids as P-selectin antagonists. J Med Chem50:21-39 (2007) 
 
P-selectin glycoprotein ligand 1
Name:P-selectin glycoprotein ligand 1
Type:PROTEIN
Mol. Mass.:43174.76
Organism:Homo sapiens (Human)
Description:ChEMBL_649756
Residue:412
BDBM50201904
NameBDBM50201904
Synonyms:3-hydroxy-2-(4-methoxyphenyl)-7,8-dimethylquinoline-4-carboxylic acid | CHEMBL219646
TypeSmall organic molecule
Emp. Form.C19H17NO4
Mol. Mass.323.3426
SMILESCOc1ccc(cc1)-c1nc2c(C)c(C)ccc2c(C(O)=O)c1O