Reaction Details
TargetDihydroorotate dehydrogenase (quinone), mitochondrial
LigandBDBM50201905
Substrate/Competitorn/a
Meas. Tech.ChEMBL_423284 (CHEMBL855443)
IC50 7±n/a nM
Citation Kaila, NJanz, KDeBernardo, SBedard, PWCamphausen, RTTam, STsao, DHKeith, JCNickerson-Nutter, CShilling, AYoung-Sciame, RWang, Q Synthesis and biological evaluation of quinoline salicylic acids as P-selectin antagonists. J Med Chem50:21-39 (2007) 
 
Dihydroorotate dehydrogenase (quinone), mitochondrial
Name:Dihydroorotate dehydrogenase (quinone), mitochondrial
Type:Enzyme
Mol. Mass.:42881.33
Organism:Homo sapiens (Human)
Description:Q02127
Residue:395
BDBM50201905
NameBDBM50201905
Synonyms:3-hydroxy-2-(4-phenoxyphenyl)quinoline-4-carboxylic acid | CHEMBL218169
TypeSmall organic molecule
Emp. Form.C22H15NO4
Mol. Mass.357.3588
SMILESOC(=O)c1c(O)c(nc2ccccc12)-c1ccc(Oc2ccccc2)cc1