Reaction Details
TargetP-selectin glycoprotein ligand 1
LigandBDBM50201943
Substrate/Competitorn/a
Meas. Tech.ChEMBL_423294 (CHEMBL855465)
IC50 1000000±n/a nM
Citation Kaila, NJanz, KDeBernardo, SBedard, PWCamphausen, RTTam, STsao, DHKeith, JCNickerson-Nutter, CShilling, AYoung-Sciame, RWang, Q Synthesis and biological evaluation of quinoline salicylic acids as P-selectin antagonists. J Med Chem50:21-39 (2007) 
 
P-selectin glycoprotein ligand 1
Name:P-selectin glycoprotein ligand 1
Type:PROTEIN
Mol. Mass.:43174.76
Organism:Homo sapiens (Human)
Description:ChEMBL_649756
Residue:412
BDBM50201943
NameBDBM50201943
Synonyms:3-hydroxy-7,8-dimethyl-2-(4-morpholinophenyl)quinoline-4-carboxylic acid | CHEMBL374669
TypeSmall organic molecule
Emp. Form.C22H22N2O4
Mol. Mass.378.4211
SMILESCc1ccc2c(C(O)=O)c(O)c(nc2c1C)-c1ccc(cc1)N1CCOCC1