Reaction Details
TargetSodium-dependent dopamine transporter
LigandBDBM50202400
Substrate/Competitorn/a
Meas. Tech.ChEMBL_423467 (CHEMBL911118)
Ki 1±n/a nM
Citation Froimowitz, MGu, YDakin, LANagafuji, PMKelley, CJParrish, DDeschamps, JRJanowsky, A Slow-onset, long-duration, alkyl analogues of methylphenidate with enhanced selectivity for the dopamine transporter. J Med Chem50:219-32 (2007) 
 
Sodium-dependent dopamine transporter
Name:Sodium-dependent dopamine transporter
Type:Multi-pass membrane protein
Mol. Mass.:68497.11
Organism:Homo sapiens (Human)
Description:Q01959
Residue:620
BDBM50202400
NameBDBM50202400
Synonyms:(RR/SS)-2-[1-(3,4-dichlorophenyl)-3-methylbutyl]-piperidine CHEMBL218999
TypeSmall organic molecule
Emp. Form.C16H23Cl2N
Mol. Mass.300.267
SMILESCC(C)CC(C1CCCCN1)c1ccc(Cl)c(Cl)c1