Reaction Details
TargetSodium-dependent dopamine transporter
LigandBDBM50202391
Substrate/Competitorn/a
Meas. Tech.ChEMBL_423467 (CHEMBL911118)
Ki 1.4±n/a nM
Citation Froimowitz, MGu, YDakin, LANagafuji, PMKelley, CJParrish, DDeschamps, JRJanowsky, A Slow-onset, long-duration, alkyl analogues of methylphenidate with enhanced selectivity for the dopamine transporter. J Med Chem50:219-32 (2007) 
 
Sodium-dependent dopamine transporter
Name:Sodium-dependent dopamine transporter
Type:Multi-pass membrane protein
Mol. Mass.:68497.11
Organism:Homo sapiens (Human)
Description:Q01959
Residue:620
BDBM50202391
NameBDBM50202391
Synonyms:(RS/SR)-methyl 2-(3,4-dichlorophenyl)-2-(piperidin-2-yl)acetate methyl 2-(3,4-dichlorophenyl)-2-(piperidin-2-yl)acetate
TypeSmall organic molecule
Emp. Form.C14H17Cl2NO2
Mol. Mass.302.196
SMILESCOC(=O)C(C1CCCCN1)c1ccc(Cl)c(Cl)c1