Reaction Details
TargetSodium-dependent dopamine transporter
LigandBDBM50202384
Substrate/Competitorn/a
Meas. Tech.ChEMBL_423467 (CHEMBL911118)
Ki 3.6±n/a nM
Citation Froimowitz, MGu, YDakin, LANagafuji, PMKelley, CJParrish, DDeschamps, JRJanowsky, A Slow-onset, long-duration, alkyl analogues of methylphenidate with enhanced selectivity for the dopamine transporter. J Med Chem50:219-32 (2007) 
 
Sodium-dependent dopamine transporter
Name:Sodium-dependent dopamine transporter
Type:Multi-pass membrane protein
Mol. Mass.:68497.11
Organism:Homo sapiens (Human)
Description:Q01959
Residue:620
BDBM50202384
NameBDBM50202384
Synonyms:(RR/SS)-2-[1-(4-chlorophenyl)-4-methylpentyl]piperidine CHEMBL373710
TypeSmall organic molecule
Emp. Form.C17H26ClN
Mol. Mass.279.848
SMILESCC(C)CCC(C1CCCCN1)c1ccc(Cl)cc1