Reaction Details
TargetSodium-dependent noradrenaline transporter
LigandBDBM50202404
Substrate/Competitorn/a
Meas. Tech.ChEMBL_423471 (CHEMBL911128)
Ki 12±n/a nM
Citation Froimowitz, MGu, YDakin, LANagafuji, PMKelley, CJParrish, DDeschamps, JRJanowsky, A Slow-onset, long-duration, alkyl analogues of methylphenidate with enhanced selectivity for the dopamine transporter. J Med Chem50:219-32 (2007) 
 
Sodium-dependent noradrenaline transporter
Name:Sodium-dependent noradrenaline transporter
Type:Multi-pass membrane protein
Mol. Mass.:69337.72
Organism:Homo sapiens (Human)
Description:P23975
Residue:617
BDBM50202404
NameBDBM50202404
Synonyms:(RR/SS)-2-[1-(3,4-dichlorophenyl)pentyl]piperidine CHEMBL374634
TypeSmall organic molecule
Emp. Form.C16H23Cl2N
Mol. Mass.300.267
SMILESCCCCC(C1CCCCN1)c1ccc(Cl)c(Cl)c1