Reaction Details
TargetAdenosine receptor A1
LigandBDBM50202575
Substrate/Competitorn/a
Meas. Tech.ChEMBL_423824 (CHEMBL911266)
Ki 62±n/a nM
Citation Baraldi, PGPreti, DTabrizi, MAFruttarolo, FRomagnoli, RCarrion, MDCara, LCMoorman, ARVarani, KBorea, PA Synthesis and biological evaluation of novel 1-deoxy-1-[6-[((hetero)arylcarbonyl)hydrazino]- 9H-purin-9-yl]-N-ethyl-beta-D-ribofuranuronamide derivatives as useful templates for the development of A2B adenosine receptor agonists. J Med Chem50:374-80 (2007) 
 
Adenosine receptor A1
Name:Adenosine receptor A1
Type:G Protein-Coupled Receptor (GPCR)
Mol. Mass.:36520.92
Organism:Homo sapiens (Human)
Description:P30542
Residue:326
BDBM50202575
NameBDBM50202575
Synonyms:1-deoxy-1-{2-chloro-6-[N'-(2-thiophen-2-yl-acetyl)-hydrazino]-9H-purin-9-yl}-N-ethyl-beta-D-ribofuranuronamide N'-(2-chloro-9-((2R,3R,4S,5S)-5-(ethylcarbamoyl)-3,4-dihydroxy-tetrahydrofuran-2-yl)-9H-purin-6-yl)-2-(thiophen-2-yl)acetohydrazide
TypeSmall organic molecule
Emp. Form.C18H20ClN7O5S
Mol. Mass.481.913
SMILESCCNC(=O)[C@H]1O[C@H]([C@H](O)[C@@H]1O)n1cnc2c(NNC(=O)Cc3cccs3)nc(Cl)nc12