Reaction Details
TargetCarbonic anhydrase 9
LigandBDBM10864
Substrate/Competitorn/a
Meas. Tech.ChEMBL_423835 (CHEMBL911286)
Ki 269±n/a nM
Citation Nishimori, IMinakuchi, TOnishi, SVullo, DScozzafava, ASupuran, CT Carbonic anhydrase inhibitors. DNA cloning, characterization, and inhibition studies of the human secretory isoform VI, a new target for sulfonamide and sulfamate inhibitors. J Med Chem50:381-8 (2007) 
 
Carbonic anhydrase 9
Name:Carbonic anhydrase 9
Type:Enzyme
Mol. Mass.:49669.03
Organism:Homo sapiens (Human)
Description:Catalytic domain of human cloned isozyme was used in the assay
Residue:459
BDBM10864
NameBDBM10864
Synonyms:4-Amino-3-bromobenzenesulfonamide CHEMBL6724 halogenosulfanilamide deriv. 5d
TypeSmall organic molecule
Emp. Form.C6H7BrN2O2S
Mol. Mass.251.101
SMILESNc1ccc(cc1Br)S(N)(=O)=O