Reaction Details
TargetCarbonic anhydrase 9
LigandBDBM10857
Substrate/Competitorn/a
Meas. Tech.ChEMBL_423835 (CHEMBL911286)
Ki 238±n/a nM
Citation Nishimori, IMinakuchi, TOnishi, SVullo, DScozzafava, ASupuran, CT Carbonic anhydrase inhibitors. DNA cloning, characterization, and inhibition studies of the human secretory isoform VI, a new target for sulfonamide and sulfamate inhibitors. J Med Chem50:381-8 (2007) 
 
Carbonic anhydrase 9
Name:Carbonic anhydrase 9
Type:Enzyme
Mol. Mass.:49669.03
Organism:Homo sapiens (Human)
Description:Catalytic domain of human cloned isozyme was used in the assay
Residue:459
BDBM10857
NameBDBM10857
Synonyms:4-aminobenzene-1-sulfonamide Sulfanilamide aromatic/heteroaromatic sulfonamide 2 | halogenosulfanilamide deriv. 5a
TypeSmall organic molecule
Emp. Form.C6H8N2O2S
Mol. Mass.172.205
SMILESNc1ccc(cc1)S(N)(=O)=O