Reaction Details
TargetCarbonic anhydrase 2
LigandBDBM10874
Substrate/Competitorn/a
Meas. Tech.ChEMBL_423834 (CHEMBL911285)
Ki 30±n/a nM
Citation Nishimori, IMinakuchi, TOnishi, SVullo, DScozzafava, ASupuran, CT Carbonic anhydrase inhibitors. DNA cloning, characterization, and inhibition studies of the human secretory isoform VI, a new target for sulfonamide and sulfamate inhibitors. J Med Chem50:381-8 (2007) 
 
Carbonic anhydrase 2
Name:Carbonic anhydrase 2
Type:Enzyme
Mol. Mass.:29250.71
Organism:Homo sapiens (Human)
Description:P00918
Residue:260
BDBM10874
NameBDBM10874
Synonyms:6-hydroxy-1,3-benzothiazole-2-sulfonamide aromatic/heteroaromatic sulfonamide 19
TypeSmall organic molecule
Emp. Form.C7H6N2O3S2
Mol. Mass.230.264
SMILESNS(=O)(=O)c1nc2ccc(O)cc2s1