Reaction Details
TargetProstaglandin E2 receptor EP3 subtype
LigandBDBM50370473
Substrate/Competitorn/a
Meas. Tech.ChEMBL_424228 (CHEMBL909002)
Ki 100±n/a nM
Citation Belley, MChan, CCGareau, YGallant, MJuteau, HHoude, KLachance, NLabelle, MSawyer, NTremblay, NLamontagne, SCarrière, MCDenis, DGreig, GMSlipetz, DGordon, RChauret, NLi, CZamboni, RJMetters, KM Comparison between two classes of selective EP(3) antagonists and their biological activities. Bioorg Med Chem Lett16:5639-42 (2006) 
 
Prostaglandin E2 receptor EP3 subtype
Name:Prostaglandin E2 receptor EP3 subtype
Type:Enzyme
Mol. Mass.:43335.03
Organism:Homo sapiens (Human)
Description:P43115
Residue:390
BDBM50370473
NameBDBM50370473
Synonyms:CHEMBL1237315
TypeSmall organic molecule
Emp. Form.C18H16O2
Mol. Mass.264.3184
SMILESOC(=O)\C=C\c1ccccc1\C=C\Cc1ccccc1