Reaction Details
TargetProstacyclin receptor
LigandBDBM50193921
Substrate/Competitorn/a
Meas. Tech.ChEMBL_424243 (CHEMBL909017)
Ki>500±n/a nM
Citation Belley, MChan, CCGareau, YGallant, MJuteau, HHoude, KLachance, NLabelle, MSawyer, NTremblay, NLamontagne, SCarrière, MCDenis, DGreig, GMSlipetz, DGordon, RChauret, NLi, CZamboni, RJMetters, KM Comparison between two classes of selective EP(3) antagonists and their biological activities. Bioorg Med Chem Lett16:5639-42 (2006) 
 
Prostacyclin receptor
Name:Prostacyclin receptor
Type:G Protein-Coupled Receptor (GPCR)
Mol. Mass.:40968.22
Organism:Homo sapiens (Human)
Description:The membranes prepared from human platelet were used in binding assay.
Residue:386
BDBM50193921
NameBDBM50193921
Synonyms:3-(2-(naphthalen-2-ylmethyl)phenyl)-N-(thiophen-2-ylsulfonyl)acrylamide | CHEMBL220802
TypeSmall organic molecule
Emp. Form.C24H19NO3S2
Mol. Mass.433.543
SMILESO=C(NS(=O)(=O)c1cccs1)\C=C\c1ccccc1Cc1ccc2ccccc2c1