Reaction Details
TargetProstaglandin E2 receptor EP3 subtype
LigandBDBM50159774
Substrate/Competitorn/a
Meas. Tech.ChEMBL_424228 (CHEMBL909002)
Ki 8±n/a nM
Citation Belley, MChan, CCGareau, YGallant, MJuteau, HHoude, KLachance, NLabelle, MSawyer, NTremblay, NLamontagne, SCarrière, MCDenis, DGreig, GMSlipetz, DGordon, RChauret, NLi, CZamboni, RJMetters, KM Comparison between two classes of selective EP(3) antagonists and their biological activities. Bioorg Med Chem Lett16:5639-42 (2006) 
 
Prostaglandin E2 receptor EP3 subtype
Name:Prostaglandin E2 receptor EP3 subtype
Type:Enzyme
Mol. Mass.:43335.03
Organism:Homo sapiens (Human)
Description:P43115
Residue:390
BDBM50159774
NameBDBM50159774
Synonyms:(E)-3-{2-[(E)-3-(4-Benzyloxy-3-methoxy-phenyl)-propenyl]-phenyl}-acrylic acid; compound with (E)-3-{2-[(E)-3-(4-benzyloxy-3-methoxy-phenyl)-allyl]-phenyl}-acrylic acid CHEMBL1237317 | CHEMBL180191
TypeSmall organic molecule
Emp. Form.C26H24O4
Mol. Mass.400.4664
SMILESCOc1cc(C\C=C\c2ccccc2\C=C\C(O)=O)ccc1OCc1ccccc1