Reaction Details
TargetProstaglandin E2 receptor EP3 subtype
LigandBDBM50193927
Substrate/Competitorn/a
Meas. Tech.ChEMBL_424228 (CHEMBL909002)
Ki 10±n/a nM
Citation Belley, MChan, CCGareau, YGallant, MJuteau, HHoude, KLachance, NLabelle, MSawyer, NTremblay, NLamontagne, SCarrière, MCDenis, DGreig, GMSlipetz, DGordon, RChauret, NLi, CZamboni, RJMetters, KM Comparison between two classes of selective EP(3) antagonists and their biological activities. Bioorg Med Chem Lett16:5639-42 (2006) 
 
Prostaglandin E2 receptor EP3 subtype
Name:Prostaglandin E2 receptor EP3 subtype
Type:Enzyme
Mol. Mass.:43335.03
Organism:Homo sapiens (Human)
Description:P43115
Residue:390
BDBM50193927
NameBDBM50193927
Synonyms:3-(2-((E)-3-(2-(benzyloxy)-5-methylphenyl)prop-1-enyl)phenyl)-N-(thiophen-2-ylsulfonyl)acrylamide | CHEMBL218179
TypeSmall organic molecule
Emp. Form.C30H27NO4S2
Mol. Mass.529.67
SMILESCc1ccc(OCc2ccccc2)c(C\C=C\c2ccccc2\C=C\C(=O)NS(=O)(=O)c2cccs2)c1