Reaction Details
TargetProstaglandin F2-alpha receptor
LigandBDBM50193929
Substrate/Competitorn/a
Meas. Tech.ChEMBL_424245 (CHEMBL909019)
Ki>500±n/a nM
Citation Belley, MChan, CCGareau, YGallant, MJuteau, HHoude, KLachance, NLabelle, MSawyer, NTremblay, NLamontagne, SCarrière, MCDenis, DGreig, GMSlipetz, DGordon, RChauret, NLi, CZamboni, RJMetters, KM Comparison between two classes of selective EP(3) antagonists and their biological activities. Bioorg Med Chem Lett16:5639-42 (2006) 
 
Prostaglandin F2-alpha receptor
Name:Prostaglandin F2-alpha receptor
Type:Enzyme
Mol. Mass.:40072.29
Organism:Homo sapiens (Human)
Description:P43088
Residue:359
BDBM50193929
NameBDBM50193929
Synonyms:3-(2-(2-(benzyloxy)-5-methylcinnamyl)phenyl)acrylic acid | CHEMBL218123
TypeSmall organic molecule
Emp. Form.C26H24O3
Mol. Mass.384.467
SMILESCc1ccc(OCc2ccccc2)c(\C=C\Cc2ccccc2\C=C\C(O)=O)c1