Reaction Details
TargetProstaglandin E2 receptor EP1 subtype
LigandBDBM50193938
Substrate/Competitorn/a
Meas. Tech.ChEMBL_424226 (CHEMBL909000)
Ki 1500±n/a nM
Citation Belley, MChan, CCGareau, YGallant, MJuteau, HHoude, KLachance, NLabelle, MSawyer, NTremblay, NLamontagne, SCarrière, MCDenis, DGreig, GMSlipetz, DGordon, RChauret, NLi, CZamboni, RJMetters, KM Comparison between two classes of selective EP(3) antagonists and their biological activities. Bioorg Med Chem Lett16:5639-42 (2006) 
 
Prostaglandin E2 receptor EP1 subtype
Name:Prostaglandin E2 receptor EP1 subtype
Type:Enzyme
Mol. Mass.:41834.57
Organism:Homo sapiens (Human)
Description:P34995
Residue:402
BDBM50193938
NameBDBM50193938
Synonyms:3-(2-(4-(benzyloxy)-3-methoxycinnamyl)phenyl)-N-(thiophen-2-ylsulfonyl)acrylamide | CHEMBL218280
TypeSmall organic molecule
Emp. Form.C30H27NO5S2
Mol. Mass.545.669
SMILESCOc1cc(\C=C\Cc2ccccc2\C=C\C(=O)NS(=O)(=O)c2cccs2)ccc1OCc1ccccc1