Reaction Details
TargetProstaglandin E2 receptor EP4 subtype
LigandBDBM50193931
Substrate/Competitorn/a
Meas. Tech.ChEMBL_424229 (CHEMBL909003)
Ki 610±n/a nM
Citation Belley, MChan, CCGareau, YGallant, MJuteau, HHoude, KLachance, NLabelle, MSawyer, NTremblay, NLamontagne, SCarrière, MCDenis, DGreig, GMSlipetz, DGordon, RChauret, NLi, CZamboni, RJMetters, KM Comparison between two classes of selective EP(3) antagonists and their biological activities. Bioorg Med Chem Lett16:5639-42 (2006) 
 
Prostaglandin E2 receptor EP4 subtype
Name:Prostaglandin E2 receptor EP4 subtype
Type:Enzyme
Mol. Mass.:53134.53
Organism:Homo sapiens (Human)
Description:P35408
Residue:488
BDBM50193931
NameBDBM50193931
Synonyms:3-(2-(4-(benzyloxy)-3-methoxycinnamyl)phenyl)acrylic acid | CHEMBL218626
TypeSmall organic molecule
Emp. Form.C26H24O4
Mol. Mass.400.4664
SMILESCOc1cc(\C=C\Cc2ccccc2\C=C\C(O)=O)ccc1OCc1ccccc1