Reaction Details
TargetProstaglandin E2 receptor EP3 subtype
LigandBDBM50193931
Substrate/Competitorn/a
Meas. Tech.ChEMBL_424228 (CHEMBL909002)
Ki 8±n/a nM
Citation Belley, MChan, CCGareau, YGallant, MJuteau, HHoude, KLachance, NLabelle, MSawyer, NTremblay, NLamontagne, SCarrière, MCDenis, DGreig, GMSlipetz, DGordon, RChauret, NLi, CZamboni, RJMetters, KM Comparison between two classes of selective EP(3) antagonists and their biological activities. Bioorg Med Chem Lett16:5639-42 (2006) 
 
Prostaglandin E2 receptor EP3 subtype
Name:Prostaglandin E2 receptor EP3 subtype
Type:Enzyme
Mol. Mass.:43335.03
Organism:Homo sapiens (Human)
Description:P43115
Residue:390
BDBM50193931
NameBDBM50193931
Synonyms:3-(2-(4-(benzyloxy)-3-methoxycinnamyl)phenyl)acrylic acid | CHEMBL218626
TypeSmall organic molecule
Emp. Form.C26H24O4
Mol. Mass.400.4664
SMILESCOc1cc(\C=C\Cc2ccccc2\C=C\C(O)=O)ccc1OCc1ccccc1