Reaction Details
TargetUDP-N-acetylglucosamine 1-carboxyvinyltransferase
LigandBDBM50194429
Substrate/Competitorn/a
Meas. Tech.ChEMBL_424366 (CHEMBL911297)
IC50 27800±n/a nM
Citation Bachelier, AMayer, RKlein, CD Sesquiterpene lactones are potent and irreversible inhibitors of the antibacterial target enzyme MurA. Bioorg Med Chem Lett16:5605-9 (2006) 
 
UDP-N-acetylglucosamine 1-carboxyvinyltransferase
Name:UDP-N-acetylglucosamine 1-carboxyvinyltransferase
Type:Protein
Mol. Mass.:44640.67
Organism:Pseudomonas aeruginosa (G-proteobacteria)
Description:P. aeruginosa MurA
Residue:421
BDBM50194429
NameBDBM50194429
Synonyms:(-)-parthenolide (Z)-(1S,2S,4R,11S)-4,8-Dimethyl-12-methylene-3,14-dioxa-tricyclo[9.3.0.0*2,4*]tetradec-7-en-13-one PARTHENOLIDE
TypeSmall organic molecule
Emp. Form.C15H20O3
Mol. Mass.248.3175
SMILESC\C1=C\CC[C@@]2(C)O[C@H]2[C@H]2OC(=O)C(=C)[C@@H]2CC1