Reaction Details
TargetUDP-N-acetylglucosamine 1-carboxyvinyltransferase
LigandBDBM50370832
Substrate/Competitorn/a
Meas. Tech.ChEMBL_424366 (CHEMBL911297)
IC50 10300±n/a nM
Citation Bachelier, AMayer, RKlein, CD Sesquiterpene lactones are potent and irreversible inhibitors of the antibacterial target enzyme MurA. Bioorg Med Chem Lett16:5605-9 (2006) 
 
UDP-N-acetylglucosamine 1-carboxyvinyltransferase
Name:UDP-N-acetylglucosamine 1-carboxyvinyltransferase
Type:Protein
Mol. Mass.:44640.67
Organism:Pseudomonas aeruginosa (G-proteobacteria)
Description:P. aeruginosa MurA
Residue:421
BDBM50370832
NameBDBM50370832
Synonyms:CNICIN
TypeSmall organic molecule
Emp. Form.C20H26O7
Mol. Mass.378.4162
SMILESCC1=CCC\C(CO)=C\[C@H]2OC(=O)C(=C)[C@@H]2[C@H](C1)OC(=O)C(=C)[C@H](O)CO