Reaction Details
TargetUDP-N-acetylglucosamine 1-carboxyvinyltransferase
LigandBDBM50411242
Substrate/Competitorn/a
Meas. Tech.ChEMBL_424366 (CHEMBL911297)
IC50>50000±n/a nM
Citation Bachelier, AMayer, RKlein, CD Sesquiterpene lactones are potent and irreversible inhibitors of the antibacterial target enzyme MurA. Bioorg Med Chem Lett16:5605-9 (2006) 
 
UDP-N-acetylglucosamine 1-carboxyvinyltransferase
Name:UDP-N-acetylglucosamine 1-carboxyvinyltransferase
Type:Protein
Mol. Mass.:44640.67
Organism:Pseudomonas aeruginosa (G-proteobacteria)
Description:P. aeruginosa MurA
Residue:421
BDBM50411242
NameBDBM50411242
Synonyms:CHEMBL86416
TypeSmall organic molecule
Emp. Form.C15H20O2
Mol. Mass.232.3181
SMILESC\C1=C/CC\C(C)=C\[C@H]2OC(=O)C(=C)[C@@H]2CC1